{"text_format":"1","workbook":"xlsx","n_sheets":6,"sheets":["Form-0","Form-1","Form-2","Form-3","EXAMPLES","DON'T DELETE autorisktable"],"not_rendered":{"charts":0,"images":0,"macros":1,"external_links":0,"defined_names":6,"comments":2,"pivot_tables":0},"unopened":[],"bounds":{"document_bytes":16777216,"sheet_cells":100000,"rows_first":2000,"rows_last":500,"rows_between":2000,"halvings":0,"cell_chars":16384,"cell_head_chars":4096},"cells_cut":0,"cells_raw":0,"read":"whole","date_system":"1900"}

{"sheet":"Form-0","index":0,"n_rows":43,"n_cols":5,"rows_kept":43,"cut":false,"hidden":false,"merged":[[0,1,0,3],[2,4,2,5],[3,4,3,5],[4,4,4,5],[5,4,5,5],[6,4,6,5],[7,4,7,5],[25,2,25,5],[26,2,26,5],[27,2,27,5],[9,2,9,5],[11,2,11,5],[19,2,19,5],[20,2,20,5],[13,2,13,5],[10,2,10,5],[39,2,39,5],[33,2,33,5],[34,2,34,5],[35,2,35,5],[36,2,36,5],[28,2,28,5],[12,2,12,5],[21,2,21,5],[22,2,22,5],[23,2,23,5],[24,2,24,5],[18,2,18,5],[41,1,41,3],[42,1,42,3],[14,2,14,5],[15,2,15,5],[16,2,16,5],[17,2,17,5],[40,1,40,3],[37,2,37,5],[38,2,38,5],[29,2,29,5],[30,2,30,5],[31,2,31,5],[32,2,32,5]]}
[null,"Form 0 : Additional information for HI RISK characteristics"]
[]
[null,{"$f":"'Form-1'!A3","v":"1. Part Number"},"Part Name","Serial Number","FAI Report Number"]
[null,{"$f":"'Form-1'!A4","v":"iex:INSPECTIONXPERT/INSPECTION_SHEET/PROJECTPROPERTIES/PROJECTPROPERTY[Name='Part Number']"},{"$f":"'Form-1'!B4","v":"iex:INSPECTIONXPERT/INSPECTION_SHEET/PROJECTPROPERTIES/PROJECTPROPERTY[Name='Part Name']"},{"$f":"'Form-1'!C4","v":"iex:INSPECTIONXPERT/INSPECTION_SHEET/PROJECTPROPERTIES/PROJECTPROPERTY[Name='Serial Number']"},{"$f":"'Form-1'!D4:E4","v":0}]
[null,"Part Revision Level","6. Drawing Number","7. Drawing revision level","8. Additional Changes"]
[null,{"$f":"'Form-1'!A6","v":"iex:INSPECTIONXPERT/INSPECTION_SHEET/PROJECTPROPERTIES/PROJECTPROPERTY[Name='Part Revision']"},{"$f":"'Form-1'!B6","v":"iex:INSPECTIONXPERT/INSPECTION_SHEET/PROJECTPROPERTIES/PROJECTPROPERTY[Name='Drawing Number']"},{"$f":"'Form-1'!C6","v":"iex:INSPECTIONXPERT/INSPECTION_SHEET/PROJECTPROPERTIES/PROJECTPROPERTY[Name='Drawing Revision']"},{"$f":"'Form-1'!D6:E6","v":0}]
[null,"9. Manufacturing Process\n Reference","10. Organization Name","11. Supplier Code","12. P.O. Number & Line Item"]
[null,{"$f":"'Form-1'!A8","v":"iex:INSPECTIONXPERT/INSPECTION_SHEET/PROJECTPROPERTIES/PROJECTPROPERTY[Name='Manufacturing process reference']"},{"$f":"'Form-1'!B8","v":"iex:INSPECTIONXPERT/INSPECTION_SHEET/PROJECTPROPERTIES/PROJECTPROPERTY[Name='Organization name']"},{"$f":"'Form-1'!C8","v":"iex:INSPECTIONXPERT/INSPECTION_SHEET/PROJECTPROPERTIES/PROJECTPROPERTY[Name='Supplier Code']"},{"$f":"'Form-1'!D8:E8","v":0}]
[null,"HI RISK CHARACTERISTIC","ACTIONS AGREED TO FOR HIGH RISK (or justification for no action)"]
["ex1","example CHAR# 45","Prepare Gage R&R report after first 10 pieces (est. target date 4/30/09) "]
["ex2","example CHAR# 54","ESTABLISH KPC-M -- contact P&W SQAR & SQE "]
["ex3","example CHAR# 62","Go-NoGo gage will not be used - measure by CMM program (J.Doe program 5/13/09)"]
["ex4","example CHAR# 99","No action required - Operation sheets specify targeting off-nominal to prolong life of tool"]
[]
[]
[]
[]
[]
[]
[]
{"$rows_left_out":24}
{"sheet":"Form-1","index":1,"n_rows":43,"n_cols":4,"rows_kept":43,"cut":false,"hidden":false,"merged":[[0,0,0,4],[1,0,1,2],[2,3,2,4],[3,3,3,4],[8,2,8,4],[9,2,9,4],[10,0,10,4],[11,0,11,4],[4,3,4,4],[5,3,5,4],[6,3,6,4],[7,3,7,4],[16,3,16,4],[17,3,17,4],[18,3,18,4],[19,3,19,4],[12,3,12,4],[13,3,13,4],[14,3,14,4],[15,3,15,4],[24,3,24,4],[25,3,25,4],[26,3,26,4],[27,3,27,4],[20,3,20,4],[21,3,21,4],[22,3,22,4],[23,3,23,4],[32,3,32,4],[33,3,33,4],[34,3,34,4],[35,3,35,4],[28,3,28,4],[29,3,29,4],[30,3,30,4],[31,3,31,4],[40,0,40,2],[41,0,41,2],[42,0,42,2],[36,3,36,4],[37,3,37,4],[38,0,38,4],[39,0,39,4]]}
["SAE AS9102 Revision A"]
["              Form 1 : Part Number Accountability"]
["1. Part Number","2. Part Name","3. Serial Number","4. FAI Report Number"]
["iex:INSPECTIONXPERT/INSPECTION_SHEET/PROJECTPROPERTIES/PROJECTPROPERTY[Name='Part Number']","iex:INSPECTIONXPERT/INSPECTION_SHEET/PROJECTPROPERTIES/PROJECTPROPERTY[Name='Part Name']","iex:INSPECTIONXPERT/INSPECTION_SHEET/PROJECTPROPERTIES/PROJECTPROPERTY[Name='Serial Number']","iex:INSPECTIONXPERT/INSPECTION_SHEET/PROJECTPROPERTIES/PROJECTPROPERTY[Name='FAI Report Number']"]
["5. Part Revision Level","6. Drawing Number","7. Drawing revision level","8. Additional Changes"]
["iex:INSPECTIONXPERT/INSPECTION_SHEET/PROJECTPROPERTIES/PROJECTPROPERTY[Name='Part Revision']","iex:INSPECTIONXPERT/INSPECTION_SHEET/PROJECTPROPERTIES/PROJECTPROPERTY[Name='Drawing Number']","iex:INSPECTIONXPERT/INSPECTION_SHEET/PROJECTPROPERTIES/PROJECTPROPERTY[Name='Drawing Revision']","iex:INSPECTIONXPERT/INSPECTION_SHEET/PROJECTPROPERTIES/PROJECTPROPERTY[Name='Additional changes']"]
["9. Manufacturing Process\n Reference","10. Organization Name","11. Supplier Code","12. P.O. Number & Line Item"]
["iex:INSPECTIONXPERT/INSPECTION_SHEET/PROJECTPROPERTIES/PROJECTPROPERTY[Name='Manufacturing process reference']","iex:INSPECTIONXPERT/INSPECTION_SHEET/PROJECTPROPERTIES/PROJECTPROPERTY[Name='Organization name']","iex:INSPECTIONXPERT/INSPECTION_SHEET/PROJECTPROPERTIES/PROJECTPROPERTY[Name='Supplier Code']","iex:INSPECTIONXPERT/INSPECTION_SHEET/PROJECTPROPERTIES/PROJECTPROPERTY[Name='P.O. number']"]
["13. Detail FAI","14. Full FAI\n     \n\nPartial FAI","Baseline Part Number including revision level"]
["     Assembly FAI","Reason for partial FAI:","iex:INSPECTIONXPERT/@PartNumberDashRev"]
["a) if above part number is a detail part only, go to Field 19\nb) if above part number is an assembly, go to the :\"INDEX\" section below."]
["INDEX of part number or sub-assembly number required to make the assembly noted above."]
["15. Part Number","16. Part Name","17. Part Serial Number","18. FAI Report Number"]
["iex:INSPECTIONXPERT/INSPECTION_SHEET/BILLOFMATERIAL/BOMITEM/@PartNumber","iex:INSPECTIONXPERT/INSPECTION_SHEET/BILLOFMATERIAL/BOMITEM/@PartName","iex:INSPECTIONXPERT/INSPECTION_SHEET/BILLOFMATERIAL/BOMITEM/@SerialNumber","iex:INSPECTIONXPERT/INSPECTION_SHEET/BILLOFMATERIAL/BOMITEM/@FAIReportNumber"]
[]
[]
[]
[]
[]
[]
{"$rows_left_out":24}
{"sheet":"Form-2","index":2,"n_rows":47,"n_cols":6,"rows_kept":47,"cut":false,"hidden":false,"merged":[[4,1,4,2],[4,3,4,4],[36,1,36,5],[37,1,37,5],[0,0,0,5],[1,0,1,5],[2,0,2,3],[3,1,3,2],[3,3,3,4],[38,1,38,5],[39,1,39,5],[40,1,40,5],[41,1,41,5],[46,1,46,2],[42,1,42,5],[43,1,43,5],[44,1,44,5],[45,0,45,5]]}
["SAE AS9102 Revision A"]
["Form 2: Product Accountability - Raw Material, Specification and Special Process (es),"]
["Functional Testing"]
["1. Part Number","2. Part Name",null,"3. Serial Number",null,"4. FAI Report\nNumber"]
[{"$f":"'Form-1'!A4","v":"iex:INSPECTIONXPERT/INSPECTION_SHEET/PROJECTPROPERTIES/PROJECTPROPERTY[Name='Part Number']"},{"$f":"'Form-1'!B4","v":"iex:INSPECTIONXPERT/INSPECTION_SHEET/PROJECTPROPERTIES/PROJECTPROPERTY[Name='Part Name']"},null,{"$f":"'Form-1'!C4","v":"iex:INSPECTIONXPERT/INSPECTION_SHEET/PROJECTPROPERTIES/PROJECTPROPERTY[Name='Serial Number']"}]
["5. Material or Process\nName","6. Specification\nNumber","7. Code","8. Special Process\nSupplier Code","9. Customer\nApproval\nVerification\n(Yes/No/Na)","10. Certificate of\nConformance\nNumber"]
["iex:INSPECTIONXPERT/INSPECTION_SHEET/SPECIFICATIONS/SPECIFICATION/@Type","iex:INSPECTIONXPERT/INSPECTION_SHEET/SPECIFICATIONS/SPECIFICATION/@Spec","iex:INSPECTIONXPERT/INSPECTION_SHEET/SPECIFICATIONS/SPECIFICATION/@Code","iex:INSPECTIONXPERT/INSPECTION_SHEET/SPECIFICATIONS/SPECIFICATION/@SupplierCode","iex:INSPECTIONXPERT/INSPECTION_SHEET/SPECIFICATIONS/SPECIFICATION/@CustomerApprovalVerification","iex:INSPECTIONXPERT/INSPECTION_SHEET/SPECIFICATIONS/SPECIFICATION/@CertificateNumber"]
[]
[]
[]
[]
[]
[]
[]
[]
[]
[]
[]
[]
[]
{"$rows_left_out":28}
{"sheet":"Form-3","index":3,"n_rows":35,"n_cols":32,"rows_kept":35,"cut":false,"hidden":false,"merged":[[34,13,34,22],[6,14,6,15],[31,10,31,11],[32,10,32,11],[26,10,26,11],[27,10,27,11],[28,10,28,11],[15,10,15,11],[16,10,16,11],[17,10,17,11],[18,10,18,11],[20,10,20,11],[21,10,21,11],[19,10,19,11],[23,10,23,11],[24,10,24,11],[34,0,34,8],[34,9,34,12],[25,10,25,11],[33,0,33,12],[30,10,30,11],[29,10,29,11],[22,10,22,11],[9,10,9,11],[10,10,10,11],[11,10,11,11],[12,10,12,11],[13,10,13,11],[14,10,14,11],[8,10,8,11],[3,13,3,15],[6,16,6,18],[6,19,6,21],[4,0,4,4],[4,6,4,8],[4,9,4,10],[4,11,4,12],[5,0,5,4],[5,6,5,8],[5,9,5,10],[5,11,5,12],[6,0,6,4],[6,6,6,8],[6,9,6,12],[7,10,7,11]]}
[null,null,null,null,null,null,null,null,null,null,null,null,null,null,null,null,null,null,{"$f":"+IF(AND(F1=\"\",G1=\"\"),\"\",IF(F1=\"\",H1/G1,(2*ABS(F1/2+G1/2-H1)/(G1-F1))))","v":""},null,null,null,null,{"$f":"+IF(AND(K1=\"\",L1=\"\"),\"\",IF(K1=\"\",M1/L1,(2*ABS(K1/2+L1/2-M1)/(L1-K1))))","v":""}]
[]
[]
[null,null,null,null,null,null,null,null,null,null,null,null,null,"CLICK HERE FOR NOTES"]
["1. Part Number",null,null,null,null,null,"2. Part Name",null,null,"3. Serial Number",null,"4. FAI Report",null,"ADDITIONAL INFORMATION FOR FAI REPORT",null,null,null,null,{"$f":"CONCATENATE(\"FAIR \",L6)","v":"FAIR iex:INSPECTIONXPERT/INSPECTION_SHEET/PROJECTPROPERTIES/PROJECTPROPERTY[Name='FAI Report Number']"},null,null,null,{"$f":"+L5","v":"4. FAI Report"}]
["iex:INSPECTIONXPERT/INSPECTION_SHEET/PROJECTPROPERTIES/PROJECTPROPERTY[Name='Part Number']",null,null,null,null,null,"iex:INSPECTIONXPERT/INSPECTION_SHEET/PROJECTPROPERTIES/PROJECTPROPERTY[Name='Part Name']",null,null,"iex:INSPECTIONXPERT/INSPECTION_SHEET/PROJECTPROPERTIES/PROJECTPROPERTY[Name='Serial Number']",null,"iex:INSPECTIONXPERT/INSPECTION_SHEET/PROJECTPROPERTIES/PROJECTPROPERTY[Name='FAI Report Number']",null,{"$f":"CONCATENATE(\"p/n \",Text12)","v":"p/n iex:INSPECTIONXPERT/INSPECTION_SHEET/PROJECTPROPERTIES/PROJECTPROPERTY[Name='Part Number']"},null,{"$f":"G6","v":"iex:INSPECTIONXPERT/INSPECTION_SHEET/PROJECTPROPERTIES/PROJECTPROPERTY[Name='Part Name']"},null,{"$f":"CONCATENATE(\"s/n \",+J6)","v":"s/n iex:INSPECTIONXPERT/INSPECTION_SHEET/PROJECTPROPERTIES/PROJECTPROPERTY[Name='Serial Number']"}]
["Dimensional Characteristic Accountability",null,null,null,null,null,"Inspection / Test Results",null,null,null,null,null,null,null,"RISK LEVEL  ",null,"other info (25 pc study)",null,null,"CONTAINMENT"]
["5. Char No.","6. Reference Location ","7. Characteristic Designator","8.\nGDT Requirement/ Comments","8. Requirement (min) \nLeave blank for GDT","8. Requirement (max)","9. Results","10. Designed Tooling","11. Non-Conformance Number","14. FAI Inspection Measuring Equipment","14. FAI Inspectors Identification",null,null,"Char. No.","RISK: accepting a non-conf. as a good part","Gage R&R (input GR&R as % of tolerance)","NUMBER OF PIECES","Capability - Cpk requires more than 25 pieces*","(express % tolerance as a decimal,                        e.g. 14% = 0.14)","ZONE SIZE","MIN (REDUCED)","MAX (REDUCED)","IMPROVE-MENT PLAN",null,"Gage R&R     (default=30%)","BLUEPRINT MIN","BLUEPRINT MAX","actual reading","RISK LEVEL","quantity column","GRR column","Cap row"]
["iex:INSPECTIONXPERT/INSPECTION_SHEET/ATTRIBUTES/ATTRIBUTE/@Uid","iex:INSPECTIONXPERT/INSPECTION_SHEET/ATTRIBUTES/ATTRIBUTE/@SheetZone","iex:INSPECTIONXPERT/INSPECTION_SHEET/ATTRIBUTES/ATTRIBUTE/@SubType","iex:INSPECTIONXPERT/INSPECTION_SHEET/ATTRIBUTES/ATTRIBUTE/@Nominal","iex:INSPECTIONXPERT/INSPECTION_SHEET/ATTRIBUTES/ATTRIBUTE/@LowerLimit","iex:INSPECTIONXPERT/INSPECTION_SHEET/ATTRIBUTES/ATTRIBUTE/@UpperLimit",null,"iex:INSPECTIONXPERT/INSPECTION_SHEET/ATTRIBUTES/ATTRIBUTE/@Process",null,"iex:INSPECTIONXPERT/INSPECTION_SHEET/ATTRIBUTES/ATTRIBUTE/@InspectionMethod",null,null,null,{"$f":"+IF(A9=\"\",\"\",A9)","v":"iex:INSPECTIONXPERT/INSPECTION_SHEET/ATTRIBUTES/ATTRIBUTE/@Uid"},{"$f":"AC9","v":{"$error":"#VALUE!"}},null,1,{"$f":"+IF(AND(E9=\"\",F9=\"\"),\"\",IF(E9=\"\",G9/F9,(2*ABS(E9/2+F9/2-G9)/(F9-E9))))","v":{"$error":"#VALUE!"}},{"$f":"IF(Q9<25,\"(%TOL)\",\"Cpk\")","v":"(%TOL)"},{"$f":"+IF(AC9=\"LO\",\"not required\",Y9/4*(AA9-Z9))","v":{"$error":"#VALUE!"}},{"$f":"IF(T9<>\"not required\",+Z9+T9,\"\")","v":{"$error":"#VALUE!"}},{"$f":"IF(T9<>\"not required\",+AA9-T9,\"\")","v":{"$error":"#VALUE!"}},{"$f":"IF('Form-3'!AC9=\"HI\",\"YES\",\"no\")","v":{"$error":"#VALUE!"}},null,{"$f":"+IF(P9=\"\",0.3,P9)","v":0.3},{"$f":"IF(E9=\"\",\"\",+E9)","v":"iex:INSPECTIONXPERT/INSPECTION_SHEET/ATTRIBUTES/ATTRIBUTE/@LowerLimit"},{"$f":"IF(F9=\"\",\"\",+F9)","v":"iex:INSPECTIONXPERT/INSPECTION_SHEET/ATTRIBUTES/ATTRIBUTE/@UpperLimit"},{"$f":"+G9","v":0},{"$f":"IF(AND(Z9=\"\",AA9=\"\"),\"\",INDEX('DON''T DELETE autorisktable'!$C$3:$J$23,AF9,AE9))","v":{"$error":"#VALUE!"}},{"$f":"VLOOKUP(Q9,'DON''T DELETE autorisktable'!$P$3:$Q$28,2)","v":5},{"$f":"VLOOKUP(Y9,'DON''T DELETE autorisktable'!$M$3:$N$12,2)","v":5},{"$f":"VLOOKUP(R9,'DON''T DELETE autorisktable'!$S$3:$W$66,$AD9)","v":{"$error":"#VALUE!"}}]
[null,null,null,null,null,null,null,null,null,null,null,null,null,{"$f":"+IF(A10=\"\",\"\",A10)","v":""},"",null,1,"",{"$f":"IF(Q10<25,\"(%TOL)\",\"Cpk\")","v":"(%TOL)"},{"$error":"#VALUE!"},{"$error":"#VALUE!"},{"$error":"#VALUE!"},{"$f":"IF('Form-3'!AC10=\"HI\",\"YES\",\"no\")","v":"no"},null,0.3,"","",0,{"$f":"IF(AND(Z10=\"\",AA10=\"\"),\"\",INDEX('DON''T DELETE autorisktable'!$C$3:$J$23,AF10,AE10))","v":""},{"$f":"VLOOKUP(Q10,'DON''T DELETE autorisktable'!$P$3:$Q$28,2)","v":5},{"$f":"VLOOKUP(Y10,'DON''T DELETE autorisktable'!$M$3:$N$12,2)","v":5},{"$f":"VLOOKUP(R10,'DON''T DELETE autorisktable'!$S$3:$W$66,$AD10)","v":{"$error":"#N/A"}}]
[null,null,null,null,null,null,null,null,null,null,null,null,null,"","",null,1,"","(%TOL)",{"$error":"#VALUE!"},{"$error":"#VALUE!"},{"$error":"#VALUE!"},{"$f":"IF('Form-3'!AC11=\"HI\",\"YES\",\"no\")","v":"no"},null,0.3,"","",0,{"$f":"IF(AND(Z11=\"\",AA11=\"\"),\"\",INDEX('DON''T DELETE autorisktable'!$C$3:$J$23,AF11,AE11))","v":""},{"$f":"VLOOKUP(Q11,'DON''T DELETE autorisktable'!$P$3:$Q$28,2)","v":5},{"$f":"VLOOKUP(Y11,'DON''T DELETE autorisktable'!$M$3:$N$12,2)","v":5},{"$f":"VLOOKUP(R11,'DON''T DELETE autorisktable'!$S$3:$W$66,$AD11)","v":{"$error":"#N/A"}}]
[null,null,null,null,null,null,null,null,null,null,null,null,null,"","",null,1,"","(%TOL)",{"$error":"#VALUE!"},{"$error":"#VALUE!"},{"$error":"#VALUE!"},{"$f":"IF('Form-3'!AC12=\"HI\",\"YES\",\"no\")","v":"no"},null,0.3,"","",0,{"$f":"IF(AND(Z12=\"\",AA12=\"\"),\"\",INDEX('DON''T DELETE autorisktable'!$C$3:$J$23,AF12,AE12))","v":""},{"$f":"VLOOKUP(Q12,'DON''T DELETE autorisktable'!$P$3:$Q$28,2)","v":5},{"$f":"VLOOKUP(Y12,'DON''T DELETE autorisktable'!$M$3:$N$12,2)","v":5},{"$f":"VLOOKUP(R12,'DON''T DELETE autorisktable'!$S$3:$W$66,$AD12)","v":{"$error":"#N/A"}}]
[null,null,null,null,null,null,null,null,null,null,null,null,null,"","",null,1,"","(%TOL)",{"$error":"#VALUE!"},{"$error":"#VALUE!"},{"$error":"#VALUE!"},{"$f":"IF('Form-3'!AC13=\"HI\",\"YES\",\"no\")","v":"no"},null,0.3,"","",0,{"$f":"IF(AND(Z13=\"\",AA13=\"\"),\"\",INDEX('DON''T DELETE autorisktable'!$C$3:$J$23,AF13,AE13))","v":""},{"$f":"VLOOKUP(Q13,'DON''T DELETE autorisktable'!$P$3:$Q$28,2)","v":5},{"$f":"VLOOKUP(Y13,'DON''T DELETE autorisktable'!$M$3:$N$12,2)","v":5},{"$f":"VLOOKUP(R13,'DON''T DELETE autorisktable'!$S$3:$W$66,$AD13)","v":{"$error":"#N/A"}}]
[null,null,null,null,null,null,null,null,null,null,null,null,null,"","",null,1,"","(%TOL)",{"$error":"#VALUE!"},{"$error":"#VALUE!"},{"$error":"#VALUE!"},{"$f":"IF('Form-3'!AC14=\"HI\",\"YES\",\"no\")","v":"no"},null,0.3,"","",0,{"$f":"IF(AND(Z14=\"\",AA14=\"\"),\"\",INDEX('DON''T DELETE autorisktable'!$C$3:$J$23,AF14,AE14))","v":""},{"$f":"VLOOKUP(Q14,'DON''T DELETE autorisktable'!$P$3:$Q$28,2)","v":5},{"$f":"VLOOKUP(Y14,'DON''T DELETE autorisktable'!$M$3:$N$12,2)","v":5},{"$f":"VLOOKUP(R14,'DON''T DELETE autorisktable'!$S$3:$W$66,$AD14)","v":{"$error":"#N/A"}}]
[null,null,null,null,null,null,null,null,null,null,null,null,null,"","",null,1,"","(%TOL)",{"$error":"#VALUE!"},{"$error":"#VALUE!"},{"$error":"#VALUE!"},{"$f":"IF('Form-3'!AC15=\"HI\",\"YES\",\"no\")","v":"no"},null,0.3,"","",0,{"$f":"IF(AND(Z15=\"\",AA15=\"\"),\"\",INDEX('DON''T DELETE autorisktable'!$C$3:$J$23,AF15,AE15))","v":""},{"$f":"VLOOKUP(Q15,'DON''T DELETE autorisktable'!$P$3:$Q$28,2)","v":5},{"$f":"VLOOKUP(Y15,'DON''T DELETE autorisktable'!$M$3:$N$12,2)","v":5},{"$f":"VLOOKUP(R15,'DON''T DELETE autorisktable'!$S$3:$W$66,$AD15)","v":{"$error":"#N/A"}}]
[null,null,null,null,null,null,null,null,null,null,null,null,null,"","",null,1,"","(%TOL)",{"$error":"#VALUE!"},{"$error":"#VALUE!"},{"$error":"#VALUE!"},{"$f":"IF('Form-3'!AC16=\"HI\",\"YES\",\"no\")","v":"no"},null,0.3,"","",0,{"$f":"IF(AND(Z16=\"\",AA16=\"\"),\"\",INDEX('DON''T DELETE autorisktable'!$C$3:$J$23,AF16,AE16))","v":""},{"$f":"VLOOKUP(Q16,'DON''T DELETE autorisktable'!$P$3:$Q$28,2)","v":5},{"$f":"VLOOKUP(Y16,'DON''T DELETE autorisktable'!$M$3:$N$12,2)","v":5},{"$f":"VLOOKUP(R16,'DON''T DELETE autorisktable'!$S$3:$W$66,$AD16)","v":{"$error":"#N/A"}}]
[null,null,null,null,null,null,null,null,null,null,null,null,null,"","",null,1,"","(%TOL)",{"$error":"#VALUE!"},{"$error":"#VALUE!"},{"$error":"#VALUE!"},{"$f":"IF('Form-3'!AC17=\"HI\",\"YES\",\"no\")","v":"no"},null,0.3,"","",0,{"$f":"IF(AND(Z17=\"\",AA17=\"\"),\"\",INDEX('DON''T DELETE autorisktable'!$C$3:$J$23,AF17,AE17))","v":""},{"$f":"VLOOKUP(Q17,'DON''T DELETE autorisktable'!$P$3:$Q$28,2)","v":5},{"$f":"VLOOKUP(Y17,'DON''T DELETE autorisktable'!$M$3:$N$12,2)","v":5},{"$f":"VLOOKUP(R17,'DON''T DELETE autorisktable'!$S$3:$W$66,$AD17)","v":{"$error":"#N/A"}}]
[null,null,null,null,null,null,null,null,null,null,null,null,null,"","",null,1,"","(%TOL)",{"$error":"#VALUE!"},{"$error":"#VALUE!"},{"$error":"#VALUE!"},{"$f":"IF('Form-3'!AC18=\"HI\",\"YES\",\"no\")","v":"no"},null,0.3,"","",0,{"$f":"IF(AND(Z18=\"\",AA18=\"\"),\"\",INDEX('DON''T DELETE autorisktable'!$C$3:$J$23,AF18,AE18))","v":""},{"$f":"VLOOKUP(Q18,'DON''T DELETE autorisktable'!$P$3:$Q$28,2)","v":5},{"$f":"VLOOKUP(Y18,'DON''T DELETE autorisktable'!$M$3:$N$12,2)","v":5},{"$f":"VLOOKUP(R18,'DON''T DELETE autorisktable'!$S$3:$W$66,$AD18)","v":{"$error":"#N/A"}}]
[null,null,null,null,null,null,null,null,null,null,null,null,null,"","",null,1,"","(%TOL)",{"$error":"#VALUE!"},{"$error":"#VALUE!"},{"$error":"#VALUE!"},{"$f":"IF('Form-3'!AC19=\"HI\",\"YES\",\"no\")","v":"no"},null,0.3,"","",0,{"$f":"IF(AND(Z19=\"\",AA19=\"\"),\"\",INDEX('DON''T DELETE autorisktable'!$C$3:$J$23,AF19,AE19))","v":""},{"$f":"VLOOKUP(Q19,'DON''T DELETE autorisktable'!$P$3:$Q$28,2)","v":5},{"$f":"VLOOKUP(Y19,'DON''T DELETE autorisktable'!$M$3:$N$12,2)","v":5},{"$f":"VLOOKUP(R19,'DON''T DELETE autorisktable'!$S$3:$W$66,$AD19)","v":{"$error":"#N/A"}}]
[null,null,null,null,null,null,null,null,null,null,null,null,null,{"$f":"+IF(A20=\"\",\"\",A20)","v":""},"",null,1,"",{"$f":"IF(Q20<25,\"(%TOL)\",\"Cpk\")","v":"(%TOL)"},{"$error":"#VALUE!"},{"$error":"#VALUE!"},{"$error":"#VALUE!"},{"$f":"IF('Form-3'!AC20=\"HI\",\"YES\",\"no\")","v":"no"},null,0.3,"","",0,{"$f":"IF(AND(Z20=\"\",AA20=\"\"),\"\",INDEX('DON''T DELETE autorisktable'!$C$3:$J$23,AF20,AE20))","v":""},{"$f":"VLOOKUP(Q20,'DON''T DELETE autorisktable'!$P$3:$Q$28,2)","v":5},{"$f":"VLOOKUP(Y20,'DON''T DELETE autorisktable'!$M$3:$N$12,2)","v":5},{"$f":"VLOOKUP(R20,'DON''T DELETE autorisktable'!$S$3:$W$66,$AD20)","v":{"$error":"#N/A"}}]
{"$rows_left_out":16}
{"sheet":"EXAMPLES","index":4,"n_rows":69,"n_cols":34,"rows_kept":69,"cut":false,"hidden":false,"merged":[[62,2,62,4],[62,12,62,13],[63,9,63,14],[31,2,31,4],[33,2,33,4],[38,9,39,14],[51,9,52,14],[43,9,48,14],[31,9,31,14],[33,9,33,14],[59,12,59,13],[54,2,54,4],[55,6,55,7],[55,9,55,14],[57,6,57,7],[57,9,57,14],[54,12,54,13],[59,2,59,4],[53,12,53,13],[24,2,24,4],[26,2,26,4],[56,6,56,7],[56,9,56,14],[49,12,49,13],[50,2,50,4],[41,2,41,4],[49,2,49,4],[28,2,29,4],[37,2,37,5],[21,18,21,20],[41,12,41,13],[21,21,21,23],[22,12,22,13],[24,12,24,13],[26,9,26,14],[34,9,35,14],[21,16,21,17],[26,35,26,41],[38,35,38,41],[60,9,60,14],[19,2,19,6],[19,8,19,10],[19,11,19,12],[19,13,19,14],[20,2,20,6],[20,8,20,10],[20,11,20,12],[20,13,20,14],[21,2,21,6],[21,8,21,10],[21,11,21,14],[42,12,42,13],[28,9,29,14]]}
[null,1,"THE F.A.I.R. PART OF THE FORM (left side) NEVER CHANGES - IT IS BASED ON ONE SINGLE PIECE PRESENTED AT TIME OF F.A.I."]
[null,null,null,"-- The right half of The form is YOUR space to add more information about the process - it is dynamic and can be edited as more information is known/discovered"]
[null,2,"\"HI RISK\" DOES NOT MEAN THE PART CANNOT SHIP ! -- It is simply an indication that the process is more likely to produce future non-conformances"]
[null,3,"LOW RISK DOES NOT MEAN THE PROCESS IS 100% SAFE !"]
[null,4,"HI RISK DEMANDS A CLOSER LOOK - AND ACTION (record actions on FORM O)"]
[null,null,4.0999999999999996,"USE MANUFACTURING ENGINEERING JUDGEMENT - Some HI RISK only be a funciton of this spreadsheet "]
[null,null,null,"4.1.1","For example -- Some targeting off-center is acceptable (to maximize tool life, to prevent rolled edges in peening, to take advantage of MMC conditions - etc.)"]
[null,null,null,"4.1.2","DOCUMENT INTENT!"]
[null,null,4.2,"GOOD GAGE R&R (low measurement error) is the most powerful tool to reduce risk level"]
[null,null,4.3,"CONTAINMENT ZONES ARE SUGGESTED RESTRICTIONS FOR \"FIRST TIME ACCEPT\" INSPECTION LIMITS"]
[null,null,null,"4.3.1","The containment zone is the \"FRINGE\" close to blueprint limits that require verification of measurements"]
[null,null,null,"4.3.2","Containment Zone = (GAGE R&R % of tolerance)x(BP max - BP min) / 4"]
[null,null,null,"4.3.3","If the part falls within the containment limits - accept as usual"]
[null,null,null,"4.3.4","If the part falls between Containment MAX and BLUEPRINT MAX - Verify the dimension using another method, DQR/SQAR Overinspect, multiple (recorded!) measurements, etc"]
[null,5,"USE THIS FORM TO TRACK IMPROVEMENTS TO THE PROCESS - during P&W Manufacturing Process Reviews (MPRs), or other reviews"]
[null,6,"ALWAYS HANDLE NON-CONFORMANCES PER PWQA6088"]
[null,7,"IF IN DOUBT - CONTACT YOUR P&W SQAR - and see below for examples"]
[]
[]
[null,null,"1. Part Number",null,null,null,null,null,"2. Part Name",null,null,"3. Serial Number",null,"4. FAI Report",null,"ADDITIONAL INFORMATION FOR FAI REPORT",null,null,null,null,{"$f":"CONCATENATE(\"FAIR \",N21)","v":"FAIR "},null,null,null,{"$f":"+N20","v":"4. FAI Report"}]
{"$rows_left_out":50}
{"sheet":"DON'T DELETE autorisktable","index":5,"n_rows":66,"n_cols":23,"rows_kept":66,"cut":false,"hidden":false,"merged":[]}
[null,null,10,15,20,25,0.3,35,40,60]
[null,null,1,2,3,4,5,6,7,8,null,null,"GRR","GRR#",null,"No of pcs","Cap column",null,"CAP","CPK ROW","10-24row","4-9row","1-3row"]
[null,1,"MOD","HI","HI","HI","HI","HI","HI","HI",null,null,0,1,null,1,5,null,0,1,21,21,21]
[null,2,"MOD","HI","HI","HI","HI","HI","HI","HI",null,null,9.9999800999999999E-2,1,null,2,5,null,0.19999989999999998,1,21,21,21]
[null,3,"MOD","HI","HI","HI","HI","HI","HI","HI",null,null,0.14999979999999999,2,null,3,5,null,0.29999989999999999,2,21,21,21]
[null,4,"MOD","HI","HI","HI","HI","HI","HI","HI",null,null,0.19999980009999999,3,null,4,4,null,0.2499999,3,21,21,21]
[null,5,"MOD","HI","HI","HI","HI","HI","HI","HI",null,null,0.2499998001,4,null,5,4,null,0.39999990000000002,4,21,21,21]
[null,6,"MOD","HI","HI","HI","HI","HI","HI","HI",null,null,0.29999980999999998,5,null,6,4,null,0.44999990000000001,5,21,21,21]
[null,7,"MOD","HI","HI","HI","HI","HI","HI","HI",null,null,0.34999979999999997,6,null,7,4,null,0.49999989999999994,6,21,21,21]
[null,8,"MOD","MOD","HI","HI","HI","HI","HI","HI",null,null,0.39999980000000002,7,null,8,4,null,0.54999989999999999,7,21,21,21]
[null,9,"MOD","MOD","HI","HI","HI","HI","HI","HI",null,null,0.49999979999999999,8,null,9,4,null,0.55999989999999999,7,21,21,20]
[null,10,"MOD","MOD","MOD","HI","HI","HI","HI","HI",null,null,0.59999979999999997,8,null,10,4,null,0.56999989999999989,7,21,21,19]
[null,11,"MOD","MOD","MOD","MOD","HI","HI","HI","HI",null,null,null,null,null,11,3,null,0.5799998999999999,7,21,21,18]
[null,12,"MOD","MOD","MOD","MOD","MOD","HI","HI","HI",null,null,null,null,null,12,3,null,0.58999989999999991,7,21,21,17]
[null,13,"MOD","MOD","MOD","MOD","MOD","MOD","HI","HI",null,null,null,null,null,13,3,null,0.59999989999999992,8,21,21,16]
[null,14,"MOD","MOD","MOD","MOD","MOD","MOD","HI","HI",null,null,null,null,null,14,3,null,0.60999989999999993,8,21,21,15]
[null,15,"MOD","MOD","MOD","MOD","MOD","MOD","MOD","HI",null,null,null,null,null,15,3,null,0.61999989999999994,8,21,21,14]
[null,16,"LO","LO","LO","MOD","MOD","MOD","MOD","MOD",null,null,null,null,null,16,3,null,0.62999989999999995,8,21,20,14]
[null,17,"LO","LO","LO","LO","MOD","MOD","MOD","MOD",null,null,null,null,null,17,3,null,0.63999989999999995,8,21,20,13]
[null,18,"LO","LO","LO","LO","LO","MOD","MOD","MOD",null,null,null,null,null,18,3,null,0.64999989999999996,9,21,19,12]
{"$rows_left_out":46}